FAIL b0a147a ds4.c:37047:52: error: ‘g_tp_block_ctx’ undeclared (first use in this function) FAIL 5d41a80 ds4.c:37047:52: error: ‘g_tp_block_ctx’ undeclared (first use in this function) FAIL c185c7a ds4_tp.c:1962:14: error: ‘ds4_tp’ has no member named ‘rdma’ FAIL 4886c56 ds4_tp.c:1962:14: error: ‘ds4_tp’ has no member named ‘rdma’ FAIL e0b8c8f ds4_tp.c:1962:14: error: ‘ds4_tp’ has no member named ‘rdma’ FAIL b941e98 ds4_tp.c:1962:14: error: ‘ds4_tp’ has no member named ‘rdma’ FAIL cffcd64 ds4_tp.c:1962:14: error: ‘ds4_tp’ has no member named ‘rdma’ FAIL 7fc640c ds4_tp.c:1962:14: error: ‘ds4_tp’ has no member named ‘rdma’ FAIL b65ad7d ds4_tp.c:1962:14: error: ‘ds4_tp’ has no member named ‘rdma’ FAIL daa0324 ds4_tp.c:1831:14: error: ‘ds4_tp’ has no member named ‘rdma’ FAIL a06a1be ds4_tp.c:1831:14: error: ‘ds4_tp’ has no member named ‘rdma’ FAIL 8cbdd76 ds4_tp.c:1831:14: error: ‘ds4_tp’ has no member named ‘rdma’ FAIL 2240272 ds4_tp.c:1831:14: error: ‘ds4_tp’ has no member named ‘rdma’ FAIL e2c3907 ds4_tp.c:1831:14: error: ‘ds4_tp’ has no member named ‘rdma’ FAIL 1cb18a2 ds4_tp.c:1746:14: error: ‘ds4_tp’ has no member named ‘rdma’ FAIL 399e48a ds4_tp.c:1746:14: error: ‘ds4_tp’ has no member named ‘rdma’ FAIL 5024711 collect2: error: ld returned 1 exit status FAIL aef6dae collect2: error: ld returned 1 exit status FAIL 313bebc collect2: error: ld returned 1 exit status FAIL 23bbbf3 collect2: error: ld returned 1 exit status